Target
Potassium voltage-gated channel subfamily H member 2
Ligand
BDBM50193865
Substrate
Meas. Tech.
ChEMBL_424194 (CHEMBL907268)
Ki
880±n/a nM
Citation
 Zhu, BYJia, ZJZhang, PSu, THuang, WGoldman, ETumas, DKadambi, VEddy, PSinha, UScarborough, RMSong, Y Inhibitory effect of carboxylic acid group on hERG binding. Bioorg Med Chem Lett 16:5507-12 (2006)  
Target
Name:
Potassium voltage-gated channel subfamily H member 2
Synonyms:
1,3-beta-glucan synthase component GLS2 ERG Eag-related protein 1 Ether-a-go-go-related gene (HERG) Ether-a-go-go-related gene potassium channel 1 Ether-a-go-go-related gene potassium channel 1 (hERG1) Ether-a-go-go-related protein 1 H-ERG KCNH2 Potassium voltage-gated channel subfamily H member 2 (hERG) Voltage-gated potassium channel subunit Kv11.1 hERG Potassium Channel 1 | putative potassium channel subunit
Type:
Multi-pass membrane protein
Mol. Mass.:
126672.65
Organism:
Homo sapiens (Human)
Description:
Q12809
Residue:
1159
  
Inhibitor
Name:
BDBM50193865
Synonyms:
2-(3-cyano-naphthalen-2-yl)-5-methyl-2H-pyrazole-3-carboxylic acid [4-(imino-pyrrolidin-1-yl-methyl)-phenyl]-amide | CHEMBL220704
Type:
Small organic molecule
Emp. Form.:
C27H24N6O
Mol. Mass.:
448.5191
SMILES:
Cc1cc(C(=O)Nc2ccc(cc2)C(=N)N2CCCC2)n(n1)-c1cc2ccccc2cc1C#N
: