Target
Potassium voltage-gated channel subfamily H member 2
Ligand
BDBM50193871
Substrate
Meas. Tech.
ChEMBL_424194 (CHEMBL907268)
Ki
51±n/a nM
Citation
 Zhu, BYJia, ZJZhang, PSu, THuang, WGoldman, ETumas, DKadambi, VEddy, PSinha, UScarborough, RMSong, Y Inhibitory effect of carboxylic acid group on hERG binding. Bioorg Med Chem Lett 16:5507-12 (2006)  
Target
Name:
Potassium voltage-gated channel subfamily H member 2
Synonyms:
1,3-beta-glucan synthase component GLS2 ERG Eag-related protein 1 Ether-a-go-go-related gene (HERG) Ether-a-go-go-related gene potassium channel 1 Ether-a-go-go-related gene potassium channel 1 (hERG1) Ether-a-go-go-related protein 1 H-ERG KCNH2 Potassium voltage-gated channel subfamily H member 2 (hERG) Voltage-gated potassium channel subunit Kv11.1 hERG Potassium Channel 1 | putative potassium channel subunit
Type:
Multi-pass membrane protein
Mol. Mass.:
126672.65
Organism:
Homo sapiens (Human)
Description:
Q12809
Residue:
1159
  
Inhibitor
Name:
BDBM50193871
Synonyms:
1-({4-[4-chloro-2-(5-chloro-pyridin-2-ylcarbamoyl)-6-methoxy-phenylcarbamoyl]-3-fluoro-phenyl}-imino-methyl)-piperidine-4-carboxylic acid ethyl ester | CHEMBL221746
Type:
Small organic molecule
Emp. Form.:
C29H28Cl2FN5O5
Mol. Mass.:
616.468
SMILES:
CCOC(=O)C1CCN(CC1)C(=N)c1ccc(C(=O)Nc2c(OC)cc(Cl)cc2C(=O)Nc2ccc(Cl)cn2)c(F)c1
: