Target
UDP-N-acetylglucosamine 1-carboxyvinyltransferase
Ligand
BDBM50370831
Substrate
Meas. Tech.
ChEMBL_424365 (CHEMBL911296)
IC50
>50000±n/a nM
Citation
 Bachelier, AMayer, RKlein, CD Sesquiterpene lactones are potent and irreversible inhibitors of the antibacterial target enzyme MurA. Bioorg Med Chem Lett 16:5605-9 (2006)  
Target
Name:
UDP-N-acetylglucosamine 1-carboxyvinyltransferase
Synonyms:
EPT MURA_ECOLI UDP-N-acetylglucosamine 1-carboxyvinyltransferase murA | murZ
Type:
Protein
Mol. Mass.:
44814.62
Organism:
Escherichia coli K-12 (Enterobacteria)
Description:
E. coli MurA
Residue:
419
  
Inhibitor
Name:
BDBM50370831
Synonyms:
Type:
Small organic molecule
Emp. Form.:
C15H18O2
Mol. Mass.:
230.3022
SMILES:
C=C1CC[C@@H]2[C@H]1[C@H]1OC(=O)C(=C)[C@@H]1CCC2=C
: