Target
Sodium- and chloride-dependent glycine transporter 1
Ligand
BDBM50195170
Substrate
Meas. Tech.
ChEMBL_424804 (CHEMBL909053)
IC50
95±n/a nM
Citation
 Zhao, ZO'Brien, JALemaire, WWilliams, DLJacobson, MASur, CPettibone, DJTiller, PRSmith, SHartman, GDWolkenberg, SELindsley, CW Synthesis and SAR of GlyT1 inhibitors derived from a series of N-((4-(morpholine-4-carbonyl)-1-(propylsulfonyl)piperidin-4-yl)methyl)benzamides. Bioorg Med Chem Lett 16:5968-72 (2006)  
Target
Name:
Sodium- and chloride-dependent glycine transporter 1
Synonyms:
GlyT-1 SC6A9_MOUSE Solute carrier family 6 member 9
Type:
PROTEIN
Mol. Mass.:
76552.86
Organism:
Mus musculus
Description:
ChEMBL_1351579
Residue:
692
  
Inhibitor
Name:
BDBM50195170
Synonyms:
2-chloro-N-((4-(morpholine-4-carbonyl)-1-(propylsulfonyl)piperidin-4-yl)methyl)benzamide | CHEMBL219714
Type:
Small organic molecule
Emp. Form.:
C21H30ClN3O5S
Mol. Mass.:
471.998
SMILES:
CCCS(=O)(=O)N1CCC(CNC(=O)c2ccccc2Cl)(CC1)C(=O)N1CCOCC1
: