Target
Sodium- and chloride-dependent taurine transporter
Ligand
BDBM50195179
Substrate
Meas. Tech.
ChEMBL_424816 (CHEMBL909060)
IC50
>30000±n/a nM
Citation
 Zhao, ZO'Brien, JALemaire, WWilliams, DLJacobson, MASur, CPettibone, DJTiller, PRSmith, SHartman, GDWolkenberg, SELindsley, CW Synthesis and SAR of GlyT1 inhibitors derived from a series of N-((4-(morpholine-4-carbonyl)-1-(propylsulfonyl)piperidin-4-yl)methyl)benzamides. Bioorg Med Chem Lett 16:5968-72 (2006)  
Target
Name:
Sodium- and chloride-dependent taurine transporter
Synonyms:
SC6A6_HUMAN | SLC6A6
Type:
PROTEIN
Mol. Mass.:
69833.28
Organism:
Homo sapiens (Human)
Description:
ChEMBL_543463
Residue:
620
  
Inhibitor
Name:
BDBM50195179
Synonyms:
2,6-difluoro-N-((4-(morpholine-4-carbonyl)-1-(propylsulfonyl)piperidin-4-yl)methyl)benzamide | CHEMBL222517
Type:
Small organic molecule
Emp. Form.:
C21H29F2N3O5S
Mol. Mass.:
473.534
SMILES:
CCCS(=O)(=O)N1CCC(CNC(=O)c2c(F)cccc2F)(CC1)C(=O)N1CCOCC1
: