Target
Peroxisome proliferator-activated receptor gamma
Ligand
BDBM50195706
Substrate
Meas. Tech.
ChEMBL_425010 (CHEMBL912531)
EC50
12±n/a nM
Citation
 Henry, JRLi, YWarshawsky, AMBrozinick, JTHawkins, EDMisener, EABriere, DAMontrose-Rafizadeh, CZink, RWYumibe, NPAjamie, RTWilken, BDevanarayan, V Tetrahydroisoquinoline PPARgamma agonists: design of novel, highly selective non-TZD antihyperglycemic agents. Bioorg Med Chem Lett 16:6293-7 (2006)  
Target
Name:
Peroxisome proliferator-activated receptor gamma
Synonyms:
NR1C3 PPAR-gamma PPARG_HUMAN Peroxisome proliferator-activated receptor gamma (PPAR gamma) Peroxisome proliferator-activated receptor gamma (PPARĪ³) peroxisome proliferator-activated receptor gamma isoform 2
Type:
Nuclear Receptor
Mol. Mass.:
57613.46
Organism:
Homo sapiens (Human)
Description:
P37231
Residue:
505
  
Inhibitor
Name:
BDBM50195706
Synonyms:
3-(5-(2-(5-methyl-2-phenyloxazol-4-yl)ethoxy)-2-(propoxycarbonyl)-1,2,3,4-tetrahydroisoquinolin-8-yl)propanoic acid | CHEMBL376460
Type:
Small organic molecule
Emp. Form.:
C28H32N2O6
Mol. Mass.:
492.5635
SMILES:
CCCOC(=O)N1CCc2c(OCCc3nc(oc3C)-c3ccccc3)ccc(CCC(O)=O)c2C1
: