Target
Peroxisome proliferator-activated receptor alpha
Ligand
BDBM50195704
Substrate
Meas. Tech.
ChEMBL_425009 (CHEMBL911429)
IC50
3415±n/a nM
Citation
 Henry, JRLi, YWarshawsky, AMBrozinick, JTHawkins, EDMisener, EABriere, DAMontrose-Rafizadeh, CZink, RWYumibe, NPAjamie, RTWilken, BDevanarayan, V Tetrahydroisoquinoline PPARgamma agonists: design of novel, highly selective non-TZD antihyperglycemic agents. Bioorg Med Chem Lett 16:6293-7 (2006)  
Target
Name:
Peroxisome proliferator-activated receptor alpha
Synonyms:
NR1C1 PPAR PPAR-alpha PPARA_HUMAN Peroxisome proliferator-activated receptor | Peroxisome proliferator-activated receptor alpha (PPAR alpha)
Type:
Enzyme
Mol. Mass.:
52222.08
Organism:
Homo sapiens (Human)
Description:
Q07869
Residue:
468
  
Inhibitor
Name:
BDBM50195704
Synonyms:
3-(2-(isobutoxycarbonyl)-5-(2-(5-methyl-2-phenyloxazol-4-yl)ethoxy)-1,2,3,4-tetrahydroisoquinolin-8-yl)propanoic acid | CHEMBL446365
Type:
Small organic molecule
Emp. Form.:
C29H34N2O6
Mol. Mass.:
506.5901
SMILES:
CC(C)COC(=O)N1CCc2c(OCCc3nc(oc3C)-c3ccccc3)ccc(CCC(O)=O)c2C1
: