Target
Vasopressin V1b receptor
Ligand
BDBM50205296
Substrate
Meas. Tech.
ChEMBL_425924 (CHEMBL907379)
Ki
0.19±n/a nM
Citation
 Pena, AMurat, BTrueba, MVentura, MAWo, NCSzeto, HHCheng, LLStoev, SGuillon, GManning, M Design and synthesis of the first selective agonists for the rat vasopressin V(1b) receptor: based on modifications of deamino-[Cys1]arginine vasopressin at positions 4 and 8. J Med Chem 50:835-47 (2007)  
Target
Name:
Vasopressin V1b receptor
Synonyms:
Avpr1b VASOPRESSIN V1B Vasopressin receptor
Type:
Enzyme Catalytic Domain
Mol. Mass.:
47104.48
Organism:
RAT
Description:
VASOPRESSIN V1B AVPR1B RAT::P48974
Residue:
425
  
Inhibitor
Name:
BDBM50205296
Synonyms:
CHEMBL385739 | d[Arg4,Dab8]VP
Type:
Small organic molecule
Emp. Form.:
C45H64N14O11S2
Mol. Mass.:
1041.207
SMILES:
NCC[C@H](NC(=O)[C@@H]1CCCN1C(=O)[C@@H]1CSSCCC(=O)N[C@@H](Cc2ccc(O)cc2)C(=O)N[C@@H](Cc2ccccc2)C(=O)N[C@@H](CCCNC(N)=N)C(=O)N[C@@H](CC(N)=O)C(=O)N1)C(=O)NCC(N)=O
: