Target
Fatty-acid amide hydrolase 1
Ligand
BDBM50411286
Substrate
Meas. Tech.
ChEMBL_428054 (CHEMBL914372)
Ki
3.5±n/a nM
Citation
 Romero, FADu, WHwang, IRayl, TJKimball, FSLeung, DHoover, HSApodaca, RLBreitenbucher, JGCravatt, BFBoger, DL Potent and selective alpha-ketoheterocycle-based inhibitors of the anandamide and oleamide catabolizing enzyme, fatty acid amide hydrolase. J Med Chem 50:1058-68 (2007)  
Target
Name:
Fatty-acid amide hydrolase 1
Synonyms:
Anandamide amidohydrolase FAAH FAAH1_HUMAN Fatty-acid amide hydrolase (FAAH) Oleamide hydrolase 1
Type:
Protein
Mol. Mass.:
63071.19
Organism:
Homo sapiens (Human)
Description:
O00519
Residue:
579
  
Inhibitor
Name:
BDBM50411286
Synonyms:
CHEMBL374708
Type:
Small organic molecule
Emp. Form.:
C23H24N2O4
Mol. Mass.:
392.4477
SMILES:
COC(=O)c1ccc(nc1)-c1cnc(o1)C(=O)CCCCCCc1ccccc1
: