Target
L-selectin
Ligand
BDBM50205396
Substrate
Meas. Tech.
ChEMBL_428319 (CHEMBL917097)
IC50
1400±n/a nM
Citation
 Kranich, RBusemann, ASBock, DSchroeter-Maas, SBeyer, DHeinemann, BMeyer, MSchierhorn, KZahlten, RWolff, GAydt, EM Rational design of novel, potent small molecule pan-selectin antagonists. J Med Chem 50:1101-15 (2007)  
Target
Name:
L-selectin
Synonyms:
LNHR LYAM1_HUMAN SELL | Selectin
Type:
PROTEIN
Mol. Mass.:
42187.20
Organism:
Homo sapiens (Human)
Description:
ChEMBL_200000
Residue:
372
  
Inhibitor
Name:
BDBM50205396
Synonyms:
3-[2-(3,4,5-trihydroxy-phenyl)-acetylamino]-benzoic acid | CHEMBL221163
Type:
Small organic molecule
Emp. Form.:
C15H13NO6
Mol. Mass.:
303.2668
SMILES:
OC(=O)c1cccc(NC(=O)Cc2cc(O)c(O)c(O)c2)c1
: