Target
Adenosine receptor A1
Ligand
BDBM50208791
Substrate
Meas. Tech.
ChEMBL_429485 (CHEMBL918607)
Ki
350±n/a nM
Citation
 Adachi, HPalaniappan, KKIvanov, AABergman, NGao, ZGJacobson, KA Structure-activity relationships of 2,N(6),5'-substituted adenosine derivatives with potent activity at the A2B adenosine receptor. J Med Chem 50:1810-27 (2007)  
Target
Name:
Adenosine receptor A1
Synonyms:
A1 adenosine receptor (hA1) AA1R_HUMAN ADORA1 Adenosine A1-receptor Adenosine receptor A1 (hA1) | Adenosine transporter (AdT)
Type:
G Protein-Coupled Receptor (GPCR)
Mol. Mass.:
36520.92
Organism:
Homo sapiens (Human)
Description:
P30542
Residue:
326
  
Inhibitor
Name:
BDBM50208791
Synonyms:
(2R,3R,4S,5R)-2-(6-amino-2-(2-(5-iodo-1H-indol-3-yl)ethoxy)-9H-purin-9-yl)-5-(hydroxymethyl)-tetrahydrofuran-3,4-diol CHEMBL222748
Type:
Small organic molecule
Emp. Form.:
C20H21IN6O5
Mol. Mass.:
552.3224
SMILES:
Nc1nc(OCCc2c[nH]c3ccc(I)cc23)nc2n(cnc12)[C@@H]1O[C@H](CO)[C@@H](O)[C@H]1O
: