Target
Adenosine receptor A3
Ligand
BDBM50208798
Substrate
Meas. Tech.
ChEMBL_429489 (CHEMBL918611)
Ki
77.8±n/a nM
Citation
 Adachi, HPalaniappan, KKIvanov, AABergman, NGao, ZGJacobson, KA Structure-activity relationships of 2,N(6),5'-substituted adenosine derivatives with potent activity at the A2B adenosine receptor. J Med Chem 50:1810-27 (2007)  
Target
Name:
Adenosine receptor A3
Synonyms:
A3 adenosine receptor (hA3) ADORA3 | Adenosine A3 receptor (A3AR)
Type:
G Protein-Coupled Receptor (GPCR)
Mol. Mass.:
36197.32
Organism:
Homo sapiens (Human)
Description:
P0DMS8
Residue:
318
  
Inhibitor
Name:
BDBM50208798
Synonyms:
(2R,3R,4S,5R)-2-(2-(2-fluorophenethoxy)-6-amino-9H-purin-9-yl)-5-(hydroxymethyl)-tetrahydrofuran-3,4-diol | CHEMBL225535
Type:
Small organic molecule
Emp. Form.:
C18H20FN5O5
Mol. Mass.:
405.3803
SMILES:
Nc1nc(OCCc2ccccc2F)nc2n(cnc12)[C@@H]1O[C@H](CO)[C@@H](O)[C@H]1O
: