Target
Adenosine receptor A2a
Ligand
BDBM50208797
Substrate
Meas. Tech.
ChEMBL_429487 (CHEMBL918609)
Ki
39.7±n/a nM
Citation
 Adachi, HPalaniappan, KKIvanov, AABergman, NGao, ZGJacobson, KA Structure-activity relationships of 2,N(6),5'-substituted adenosine derivatives with potent activity at the A2B adenosine receptor. J Med Chem 50:1810-27 (2007)  
Target
Name:
Adenosine receptor A2a
Synonyms:
A2A adenosine receptor (hA2A) ADENOSINE A2 ADORA2 Adenosine A2A receptor (A2AAR)
Type:
G Protein-Coupled Receptor (GPCR)
Mol. Mass.:
44716.46
Organism:
Homo sapiens (Human)
Description:
P29274
Residue:
412
  
Inhibitor
Name:
BDBM50208797
Synonyms:
2-(3''-(4''-bromo-indolyl)ethyloxy)adenosine | CHEMBL434377
Type:
Small organic molecule
Emp. Form.:
C20H21BrN6O5
Mol. Mass.:
505.322
SMILES:
Nc1nc(OCCc2c[nH]c3cccc(Br)c23)nc2n(cnc12)[C@@H]1O[C@H](CO)[C@@H](O)[C@H]1O
: