Target
Adenosine receptor A2a
Ligand
BDBM50208812
Substrate
Meas. Tech.
ChEMBL_429487 (CHEMBL918609)
Ki
373±n/a nM
Citation
 Adachi, HPalaniappan, KKIvanov, AABergman, NGao, ZGJacobson, KA Structure-activity relationships of 2,N(6),5'-substituted adenosine derivatives with potent activity at the A2B adenosine receptor. J Med Chem 50:1810-27 (2007)  
Target
Name:
Adenosine receptor A2a
Synonyms:
A2A adenosine receptor (hA2A) ADENOSINE A2 ADORA2 Adenosine A2A receptor (A2AAR)
Type:
G Protein-Coupled Receptor (GPCR)
Mol. Mass.:
44716.46
Organism:
Homo sapiens (Human)
Description:
P29274
Residue:
412
  
Inhibitor
Name:
BDBM50208812
Synonyms:
2-(2''-indolylethyloxy)adenosine | CHEMBL374461
Type:
Small organic molecule
Emp. Form.:
C20H22N6O5
Mol. Mass.:
426.4259
SMILES:
Nc1nc(OCCc2cc3ccccc3[nH]2)nc2n(cnc12)[C@@H]1O[C@H](CO)[C@@H](O)[C@H]1O
: