Target
Adenosine receptor A2a
Ligand
BDBM50156641
Substrate
Meas. Tech.
ChEMBL_429600 (CHEMBL919032)
Ki
70±n/a nM
Citation
 Peng, HKumaravel, GYao, GSha, LWang, JVan Vlijmen, HBohnert, THuang, CVu, CBEnsinger, CLChang, HEngber, TMWhalley, ETPetter, RC Novel bicyclic piperazine derivatives of triazolotriazine and triazolopyrimidines as highly potent and selective adenosine A2A receptor antagonists. J Med Chem 47:6218-29 (2004)  
Target
Name:
Adenosine receptor A2a
Synonyms:
AA2AR_RAT Adenosine A2 receptor Adenosine Receptors A2a (A2a) Adenosine receptors A2a Rat striatal adenosine A2a receptor
Type:
G Protein-Coupled Receptor (GPCR)
Mol. Mass.:
45015.65
Organism:
Rattus norvegicus (rat)
Description:
Rat A2A receptors expressed in CHO cells.
Residue:
410
  
Inhibitor
Name:
BDBM50156641
Synonyms:
(7RS,9aSR)-2-furan-2-yl-5-[7-(4-methoxy-phenoxymethyl)-octahydro-pyrido[1,2-a]pyrazin-2-yl]-[1,2,4]triazolo[1,5-a][1,3,5]triazin-7-ylamine | CHEMBL387327
Type:
Small organic molecule
Emp. Form.:
C24H28N8O3
Mol. Mass.:
476.5309
SMILES:
COc1ccc(OC[C@@H]2CC[C@H]3CN(CCN3C2)c2nc(N)n3nc(nc3n2)-c2ccco2)cc1
: