Target
Kappa-type opioid receptor
Ligand
BDBM50157791
Substrate
Meas. Tech.
ChEMBL_430154 (CHEMBL919063)
Ki
25±n/a nM
Citation
 Srivastava, SKShefali, SMiller, CNAceto, MDTraynor, JRLewis, JWHusbands, SM Effects of substitution on the pyrrole N atom in derivatives of tetrahydronaltrindole, tetrahydrooxymorphindole, and a related 4,5-epoxyphenylpyrrolomorphinan. J Med Chem 47:6645-8 (2004)  
Target
Name:
Kappa-type opioid receptor
Synonyms:
K-OR-1 Kappa-opioid receptor (KOR) Kappa-type opioid receptor (KOR) OPIATE Kappa OPRK1 kappa opioid receptor (KOR)
Type:
G Protein-Coupled Receptor (GPCR)
Mol. Mass.:
42648.76
Organism:
Homo sapiens (Human)
Description:
P41145
Residue:
380
  
Inhibitor
Name:
BDBM50157791
Synonyms:
1'-cyclohexylmethyl-17-cyclopropylmethyl-6-7-didehydro-3,14-dihydroxy-4,5alpha-epoxy-4',5',6',7'-tetrahydroindolo[2',3';6,7]morphinan | CHEMBL385316
Type:
Small organic molecule
Emp. Form.:
C33H42N2O3
Mol. Mass.:
514.6982
SMILES:
Oc1ccc2CC3N(CC4CC4)CC[C@@]45[C@@H](Oc1c24)c1c(C[C@@]35O)c2CCCCc2n1CC1CCCCC1
: