Target
Melanocortin receptor 3
Ligand
BDBM50422958
Substrate
Meas. Tech.
ChEMBL_430377 (CHEMBL915320)
EC50
22600±n/a nM
Citation
 Joseph, CGWang, XSScott, JWBauzo, RMXiang, ZRichards, NGHaskell-Luevano, C Stereochemical studies of the monocyclic agouti-related protein (103-122) Arg-Phe-Phe residues: conversion of a melanocortin-4 receptor antagonist into an agonist and results in the discovery of a potent and selective melanocortin-1 agonist. J Med Chem 47:6702-10 (2004)  
Target
Name:
Melanocortin receptor 3
Synonyms:
MC3-R Mc3r
Type:
PROTEIN
Mol. Mass.:
35808.24
Organism:
Mus musculus
Description:
ChEMBL_1498848
Residue:
323
  
Inhibitor
Name:
BDBM50422958
Synonyms:
CHEMBL2304246
Type:
Small organic molecule
Emp. Form.:
C107H152N28O27S2
Mol. Mass.:
2326.653
SMILES:
CC(C)C[C@H](NC(=O)[C@H](CCCCN)NC(=O)[C@H](CCCNC(N)=N)NC(=O)[C@H](C)NC(=O)[C@H](Cc1ccc(O)cc1)NC(=O)[C@@H]1CSSC[C@H](NC(=O)[C@H](Cc2ccc(O)cc2)NC(=O)[C@H](C)NC(=O)[C@@H](NC(=O)[C@H](C)NC(=O)[C@H](C)NC(=O)[C@@H]2CCCN2C(=O)[C@@H](N)CC(O)=O)[C@@H](C)O)C(=O)N[C@H](CCCNC(N)=N)C(=O)N[C@@H](Cc2ccccc2)C(=O)N[C@H](Cc2ccccc2)C(=O)N[C@@H](CC(N)=O)C(=O)N[C@@H](C)C(=O)N[C@@H](Cc2ccccc2)C(=O)N1)C(O)=O
: