Target
1,25-dihydroxyvitamin D(3) 24-hydroxylase, mitochondrial
Ligand
BDBM50411322
Substrate
Meas. Tech.
ChEMBL_430506 (CHEMBL917755)
IC50
9.7±n/a nM
Citation
 Kahraman, MSinishtaj, SDolan, PMKensler, TWPeleg, SSaha, UChuang, SSBernstein, GKorczak, BPosner, GH Potent, selective and low-calcemic inhibitors of CYP24 hydroxylase: 24-sulfoximine analogues of the hormone 1alpha,25-dihydroxyvitamin D(3). J Med Chem 47:6854-63 (2004)  
Target
Name:
1,25-dihydroxyvitamin D(3) 24-hydroxylase, mitochondrial
Synonyms:
1,25-dihydroxyvitamin D(3) 24-hydroxylase, mitochondrial CYP24 Cytochrome P450 24A1
Type:
Protein
Mol. Mass.:
58889.66
Organism:
Homo sapiens (Human)
Description:
Q07973
Residue:
514
  
Inhibitor
Name:
BDBM50411322
Synonyms:
Type:
Small organic molecule
Emp. Form.:
C28H41NO3S
Mol. Mass.:
471.695
SMILES:
[#6]-[#6@H](-[#6]-[#6]=S([#7])(=O)c1ccccc1)-[#6@H]1-[#6]-[#6]-[#6@H]2\[#6](-[#6]-[#6]-[#6][C@]12[#6])=[#6]\[#6]=[#6]-1\[#6]-[#6@@H](-[#8])-[#6]-[#6@H](-[#8])-[#6]-1
: