Target
Tripeptidyl-peptidase 2
Ligand
BDBM50176911
Substrate
Meas. Tech.
ChEMBL_430943 (CHEMBL914885)
Ki
35000±n/a nM
Citation
 Ganellin, CRBishop, PBBambal, RBChan, SMLeblond, BMoore, ANZhao, LBourgeat, PRose, CVargas, FSchwartz, JC Inhibitors of tripeptidyl peptidase II. 3. Derivation of butabindide by successive structure optimizations leading to a potential general approach to designing exopeptidase inhibitors. J Med Chem 48:7333-42 (2005)  
Target
Name:
Tripeptidyl-peptidase 2
Synonyms:
TPP2_RAT Tripeptidyl aminopeptidase
Type:
PROTEIN
Mol. Mass.:
138287.08
Organism:
Rattus norvegicus
Description:
ChEMBL_211948
Residue:
1249
  
Inhibitor
Name:
BDBM50176911
Synonyms:
(2S)-aminobutyryl-L-pipecolinic acid n-butylamide | CHEMBL223952
Type:
Small organic molecule
Emp. Form.:
C14H27N3O2
Mol. Mass.:
269.3831
SMILES:
CCCCNC(=O)[C@@H]1CCCCN1C(=O)[C@@H](N)CC
: