Target
Sodium-dependent noradrenaline transporter
Ligand
BDBM50177110
Substrate
Meas. Tech.
ChEMBL_431029 (CHEMBL915899)
Ki
61±n/a nM
Citation
 Kotturi, SVJiang, SChang, ACAbraham, PNavarro, HAKuhar, MJCarroll, FI Synthesis and monoamine transporter binding properties of 2,3-diaryltropanes. J Med Chem 48:7437-44 (2005)  
Target
Name:
Sodium-dependent noradrenaline transporter
Synonyms:
Monoamine transporter NET Noradrenaline Transporter (NET) Norepinephrine transporter protein (NET) SLC6A2 Sodium-dependent noradrenaline transporter (NET) | Solute carrier family 6 member 2
Type:
Multi-pass membrane protein
Mol. Mass.:
69337.72
Organism:
Homo sapiens (Human)
Description:
P23975
Residue:
617
  
Inhibitor
Name:
BDBM50177110
Synonyms:
2-beta-(4-fluorophenyl)-3-beta-(4-methylphenyl)tropane | CHEMBL225235
Type:
Small organic molecule
Emp. Form.:
C21H24FN
Mol. Mass.:
309.4204
SMILES:
CN1C2CCC1[C@H]([C@H](C2)c1ccc(C)cc1)c1ccc(F)cc1
: