Target
Androgen receptor
Ligand
BDBM50197366
Substrate
Meas. Tech.
ChEMBL_432232 (CHEMBL914604)
IC50
110±n/a nM
Citation
 Tachibana, KImaoka, IYoshino, HEmura, TKodama, HFuruta, YKato, NNakamura, MOhta, MTaniguchi, KIshikura, NNagamuta, MOnuma, ESato, H Discovery of 7alpha-substituted dihydrotestosterones as androgen receptor pure antagonists and their structure-activity relationships. Bioorg Med Chem 15:174-85 (2006)  
Target
Name:
Androgen receptor
Synonyms:
ANDR_HUMAN Androgen Receptor Androgen receptor/Baculoviral IAP repeat-containing protein 2 Dihydrotestosterone receptor Nuclear receptor subfamily 3 group C member 4
Type:
Receptor
Mol. Mass.:
99185.27
Organism:
Homo sapiens (Human)
Description:
CHO cells were stably transfected with human AR gene.
Residue:
920
  
Inhibitor
Name:
BDBM50197366
Synonyms:
CHEMBL225147 | N,N-dimethyl-7-(17b-hydroxy-5a-androstan-3-one-7a-yl)heptanamide
Type:
Small organic molecule
Emp. Form.:
C28H47NO3
Mol. Mass.:
445.6777
SMILES:
CN(C)C(=O)CCCCCCC1C[C@H]2CC(=O)CC[C@]2(C)[C@H]2CC[C@]3(C)[C@@H](O)CC[C@H]3[C@H]12
: