Target
Androgen receptor
Ligand
BDBM50197385
Substrate
Meas. Tech.
ChEMBL_432234 (CHEMBL914606)
IC50
340±n/a nM
Citation
 Tachibana, KImaoka, IYoshino, HEmura, TKodama, HFuruta, YKato, NNakamura, MOhta, MTaniguchi, KIshikura, NNagamuta, MOnuma, ESato, H Discovery of 7alpha-substituted dihydrotestosterones as androgen receptor pure antagonists and their structure-activity relationships. Bioorg Med Chem 15:174-85 (2006)  
Target
Name:
Androgen receptor
Synonyms:
ANDR_HUMAN Androgen Receptor Androgen receptor/Baculoviral IAP repeat-containing protein 2 Dihydrotestosterone receptor Nuclear receptor subfamily 3 group C member 4
Type:
Receptor
Mol. Mass.:
99185.27
Organism:
Homo sapiens (Human)
Description:
CHO cells were stably transfected with human AR gene.
Residue:
920
  
Inhibitor
Name:
BDBM50197385
Synonyms:
CHEMBL224770 | N-n-butyl-N-methyl-8-(17b-hydroxy-5a-androstan-3-one-7a-yl)octanamide
Type:
Small organic molecule
Emp. Form.:
C32H55NO3
Mol. Mass.:
501.784
SMILES:
CCCCN(C)C(=O)CCCCCCCC1C[C@H]2CC(=O)CC[C@]2(C)[C@H]2CC[C@]3(C)[C@@H](O)CC[C@H]3[C@H]12
: