Target
Signal transducer and activator of transcription 6
Ligand
BDBM50197554
Substrate
Meas. Tech.
ChEMBL_432301 (CHEMBL915562)
IC50
21±n/a nM
Citation
 Nagashima, SYokota, MNakai, EKuromitsu, SOhga, KTakeuchi, MTsukamoto, SOhta, M Synthesis and evaluation of 2-{[2-(4-hydroxyphenyl)-ethyl]amino}pyrimidine-5-carboxamide derivatives as novel STAT6 inhibitors. Bioorg Med Chem 15:1044-55 (2006)  
Target
Name:
Signal transducer and activator of transcription 6
Synonyms:
STAT6 | STAT6_HUMAN
Type:
PROTEIN
Mol. Mass.:
94129.45
Organism:
Homo sapiens (Human)
Description:
ChEMBL_881634
Residue:
847
  
Inhibitor
Name:
BDBM50197554
Synonyms:
2-(3-chloro-4-hydroxyphenethylamino)-4-(benzylamino)pyrimidine-5-carboxamide AS-1517499 | CHEMBL228192
Type:
Small organic molecule
Emp. Form.:
C20H20ClN5O2
Mol. Mass.:
397.858
SMILES:
NC(=O)c1cnc(NCCc2ccc(O)c(Cl)c2)nc1NCc1ccccc1
: