Target
Signal transducer and activator of transcription 6
Ligand
BDBM50370956
Substrate
Meas. Tech.
ChEMBL_432301 (CHEMBL915562)
IC50
83±n/a nM
Citation
 Nagashima, SYokota, MNakai, EKuromitsu, SOhga, KTakeuchi, MTsukamoto, SOhta, M Synthesis and evaluation of 2-{[2-(4-hydroxyphenyl)-ethyl]amino}pyrimidine-5-carboxamide derivatives as novel STAT6 inhibitors. Bioorg Med Chem 15:1044-55 (2006)  
Target
Name:
Signal transducer and activator of transcription 6
Synonyms:
STAT6 | STAT6_HUMAN
Type:
PROTEIN
Mol. Mass.:
94129.45
Organism:
Homo sapiens (Human)
Description:
ChEMBL_881634
Residue:
847
  
Inhibitor
Name:
BDBM50370956
Synonyms:
CHEMBL389647
Type:
Small organic molecule
Emp. Form.:
C20H20BrN5O2
Mol. Mass.:
442.309
SMILES:
Cc1cccc(Nc2nc(NCCc3ccc(O)c(Br)c3)ncc2C(N)=O)c1
: