Target
Metabotropic glutamate receptor 5
Ligand
BDBM50084137
Substrate
Meas. Tech.
ChEMBL_432812 (CHEMBL914080)
Ki
19±n/a nM
Citation
 Hintermann, SVranesic, IAllgeier, HBrülisauer, AHoyer, DLemaire, MMoenius, TUrwyler, SWhitebread, SGasparini, FAuberson, YP ABP688, a novel selective and high affinity ligand for the labeling of mGlu5 receptors: identification, in vitro pharmacology, pharmacokinetic and biodistribution studies. Bioorg Med Chem 15:903-14 (2006)  
Target
Name:
Metabotropic glutamate receptor 5
Synonyms:
GRM5_RAT Grm5 Mglur5 metabotropic glutamate 5/1-C metabotropic glutamate 5a
Type:
Enzyme
Mol. Mass.:
131900.14
Organism:
Rattus norvegicus (Rat)
Description:
P31424
Residue:
1203
  
Inhibitor
Name:
BDBM50084137
Synonyms:
2-Methyl-6-(phenylethynyl)pyridine 2-Methyl-6-phenylethynyl-pyridine(MPEP) 2-methyl-6-(phenyl-ethynyl)pyridine 6-methyl-2-(2-phenylethynyl)pyridine CHEMBL66654 US10618900, No. MPEP | [3H]-2-methyl-6-(phenylethynyl)-pyridine
Type:
Small organic molecule
Emp. Form.:
C14H11N
Mol. Mass.:
193.2438
SMILES:
Cc1cccc(n1)C#Cc1ccccc1
: