Target
Dipeptidyl peptidase 4
Ligand
BDBM50198846
Substrate
Meas. Tech.
ChEMBL_432850 (CHEMBL915599)
IC50
147±n/a nM
Citation
 Sakashita, HAkahoshi, FYoshida, TKitajima, HHayashi, YIshii, STakashina, YTsutsumiuchi, ROno, S Lead optimization of [(S)-gamma-(arylamino)prolyl]thiazolidine focused on gamma-substituent: Indoline compounds as potent DPP-IV inhibitors. Bioorg Med Chem 15:641-55 (2006)  
Target
Name:
Dipeptidyl peptidase 4
Synonyms:
ADABP Adenosine deaminase complexing protein 2 CD_antigen=CD26 DPP4 DPPIV Dipeptidyl peptidase 4 (DPP IV) Dipeptidyl peptidase 4 (DPP4) Dipeptidyl peptidase 4 membrane form Dipeptidyl peptidase IV Dipeptidyl peptidase IV (DDP-IV) Dipeptidyl peptidase IV membrane form Dipeptidyl peptidase-IV (DPP-4) T-cell activation antigen CD26 | TP103
Type:
Enzyme
Mol. Mass.:
88271.01
Organism:
Homo sapiens (Human)
Description:
P27487
Residue:
766
  
Inhibitor
Name:
BDBM50198846
Synonyms:
((2S,4S)-4-(phenylamino)pyrrolidin-2-yl)(thiazolidin-3-yl)methanone | CHEMBL223114
Type:
Small organic molecule
Emp. Form.:
C14H19N3OS
Mol. Mass.:
277.385
SMILES:
O=C([C@@H]1C[C@@H](CN1)Nc1ccccc1)N1CCSC1
: