Target
Dipeptidyl peptidase 4
Ligand
BDBM50198858
Substrate
Meas. Tech.
ChEMBL_432850 (CHEMBL915599)
IC50
13.6±n/a nM
Citation
 Sakashita, HAkahoshi, FYoshida, TKitajima, HHayashi, YIshii, STakashina, YTsutsumiuchi, ROno, S Lead optimization of [(S)-gamma-(arylamino)prolyl]thiazolidine focused on gamma-substituent: Indoline compounds as potent DPP-IV inhibitors. Bioorg Med Chem 15:641-55 (2006)  
Target
Name:
Dipeptidyl peptidase 4
Synonyms:
ADABP Adenosine deaminase complexing protein 2 CD_antigen=CD26 DPP4 DPPIV Dipeptidyl peptidase 4 (DPP IV) Dipeptidyl peptidase 4 (DPP4) Dipeptidyl peptidase 4 membrane form Dipeptidyl peptidase IV Dipeptidyl peptidase IV (DDP-IV) Dipeptidyl peptidase IV membrane form Dipeptidyl peptidase-IV (DPP-4) T-cell activation antigen CD26 | TP103
Type:
Enzyme
Mol. Mass.:
88271.01
Organism:
Homo sapiens (Human)
Description:
P27487
Residue:
766
  
Inhibitor
Name:
BDBM50198858
Synonyms:
3-{(2S,4S)-4-[N-(4-cyanophenylmethyl)-N-(ethoxycarbonylmethyl)amino]-2-pyrrolidinylcarbonyl}-1,3-thiazolidine | CHEMBL389624
Type:
Small organic molecule
Emp. Form.:
C20H26N4O3S
Mol. Mass.:
402.51
SMILES:
CCOC(=O)CN(Cc1ccc(cc1)C#N)[C@@H]1CN[C@@H](C1)C(=O)N1CCSC1
: