Target
Dipeptidyl peptidase 8
Ligand
BDBM50198841
Substrate
Meas. Tech.
ChEMBL_432852 (CHEMBL915601)
IC50
736.5±n/a nM
Citation
 Sakashita, HAkahoshi, FYoshida, TKitajima, HHayashi, YIshii, STakashina, YTsutsumiuchi, ROno, S Lead optimization of [(S)-gamma-(arylamino)prolyl]thiazolidine focused on gamma-substituent: Indoline compounds as potent DPP-IV inhibitors. Bioorg Med Chem 15:641-55 (2006)  
Target
Name:
Dipeptidyl peptidase 8
Synonyms:
DPP8 DPRP-1 Dipeptidyl peptidase 8 (DPP-8) Dipeptidyl peptidase 8/9 Dipeptidyl peptidase VIII Prolyl dipeptidase DPP8
Type:
Enzyme
Mol. Mass.:
103342.62
Organism:
Homo sapiens (Human)
Description:
Q6V1X1
Residue:
898
  
Inhibitor
Name:
BDBM50198841
Synonyms:
3-[(2S,4S)-4-(1-indolinyl)-2-pyrrolidinylcarbonyl]-1,3-thiazolidine | CHEMBL389244
Type:
Small organic molecule
Emp. Form.:
C16H21N3OS
Mol. Mass.:
303.422
SMILES:
O=C([C@@H]1C[C@@H](CN1)N1CCc2ccccc12)N1CCSC1
: