Target
Protein arginine N-methyltransferase 1 [11-371]
Ligand
BDBM50206427
Substrate
Meas. Tech.
ChEMBL_434655 (CHEMBL914212)
IC50
1200±n/a nM
Citation
 Spannhoff, AHeinke, RBauer, ITrojer, PMetzger, EGust, RSchüle, RBrosch, GSippl, WJung, M Target-based approach to inhibitors of histone arginine methyltransferases. J Med Chem 50:2319-25 (2007)  
Target
Name:
Protein arginine N-methyltransferase 1 [11-371]
Synonyms:
ANM1_HUMAN HRMT1L2 PRMT1 Protein arginine methyltransferase 1 (PRMT1) | Protein-arginine N-methyltransferase 1
Type:
Protein
Mol. Mass.:
41506.52
Organism:
Homo sapiens (Human)
Description:
Q99873[11-371]
Residue:
361
  
Inhibitor
Name:
BDBM50206427
Synonyms:
7,7'-carbonylbis(azanediyl)bis(4-hydroxynaphthalene-2-sulfonic acid) CHEMBL221047
Type:
Small organic molecule
Emp. Form.:
C21H16N2O9S2
Mol. Mass.:
504.49
SMILES:
Oc1cc(cc2cc(NC(=O)Nc3ccc4c(O)cc(cc4c3)S(O)(=O)=O)ccc12)S(O)(=O)=O
: