Target
RmtA
Ligand
BDBM50210461
Substrate
Meas. Tech.
ChEMBL_434652 (CHEMBL914209)
IC50
29900±n/a nM
Citation
 Spannhoff, AHeinke, RBauer, ITrojer, PMetzger, EGust, RSchüle, RBrosch, GSippl, WJung, M Target-based approach to inhibitors of histone arginine methyltransferases. J Med Chem 50:2319-25 (2007)  
Target
Name:
RmtA
Synonyms:
Type:
PROTEIN
Mol. Mass.:
39351.26
Organism:
Emericella nidulans
Description:
ChEMBL_475539
Residue:
345
  
Inhibitor
Name:
BDBM50210461
Synonyms:
(stilbamidine)4-[2-[4-amino(imino)methylphenyl]-(E)-1-ethenyl]phenyl-iminomethanamine 4-((E)-2-{4-[(Z)-amino(imino)methyl]phenyl}vinyl)benzenecarboximidamide CHEMBL142304 stilbamidine
Type:
Small organic molecule
Emp. Form.:
C16H16N4
Mol. Mass.:
264.325
SMILES:
NC(=N)c1ccc(\C=C\c2ccc(cc2)C(N)=N)cc1
: