Target
Enoyl-acyl-carrier protein reductase
Ligand
BDBM8726
Substrate
Meas. Tech.
ChEMBL_436469 (CHEMBL904776)
Ki
660±n/a nM
Citation
 Kumar, GParasuraman, PSharma, SKBanerjee, TKarmodiya, KSurolia, NSurolia, A Discovery of a rhodanine class of compounds as inhibitors of Plasmodium falciparum enoyl-acyl carrier protein reductase. J Med Chem 50:2665-75 (2007)  
Target
Name:
Enoyl-acyl-carrier protein reductase
Synonyms:
Type:
PROTEIN
Mol. Mass.:
49770.86
Organism:
Plasmodium falciparum
Description:
ChEMBL_795989
Residue:
432
  
Inhibitor
Name:
BDBM8726
Synonyms:
5-chloro-2-(2,4-dichlorophenoxy)phenol TCL US20230414581, Compound 35
Type:
Small organic molecule
Emp. Form.:
C12H7Cl3O2
Mol. Mass.:
289.542
SMILES:
Oc1cc(Cl)ccc1Oc1ccc(Cl)cc1Cl
: