Target
Transporter
Ligand
BDBM50142839
Substrate
Meas. Tech.
ChEMBL_436642 (CHEMBL904952)
Ki
270±n/a nM
Citation
 Kim, DIDeutsch, HMYe, XSchweri, MM Synthesis and pharmacology of site-specific cocaine abuse treatment agents: restricted rotation analogues of methylphenidate. J Med Chem 50:2718-31 (2007)  
Target
Name:
Transporter
Synonyms:
Monoamine transporters; Norepininephrine & dopamine | Norepinephrine Monoamine transporters
Type:
PROTEIN
Mol. Mass.:
66787.87
Organism:
Rattus norvegicus
Description:
ChEMBL_1463061
Residue:
597
  
Inhibitor
Name:
BDBM50142839
Synonyms:
(R)-2-((R)-Methoxycarbonyl-phenyl-methyl)-piperidinium; chloride CHEMBL904 Focalin | Focalin xr
Type:
Small organic molecule
Emp. Form.:
C14H20NO2
Mol. Mass.:
234.3136
SMILES:
COC(=O)[C@@H]([C@H]1CCCC[NH2+]1)c1ccccc1
: