Target
Potassium voltage-gated channel subfamily A member 5
Ligand
BDBM50213093
Substrate
Meas. Tech.
ChEMBL_436809 (CHEMBL905111)
IC50
5900±n/a nM
Citation
 Plouvier, BBeatch, GNJung, GLZolotoy, ASheng, TClohs, LBarrett, TDFedida, DWang, WQZhu, JJLiu, YAbraham, SLynn, LDong, YWall, RAWalker, MJ Synthesis and biological studies of novel 2-aminoalkylethers as potential antiarrhythmic agents for the conversion of atrial fibrillation. J Med Chem 50:2818-41 (2007)  
Target
Name:
Potassium voltage-gated channel subfamily A member 5
Synonyms:
HK2 KCNA5 Potassium voltage-gated channel subfamily A member 5 Voltage-gated potassium channel subunit Kv1.5
Type:
Enzyme
Mol. Mass.:
67222.47
Organism:
Homo sapiens (Human)
Description:
P22460
Residue:
613
  
Inhibitor
Name:
BDBM50213093
Synonyms:
(1R,2R)-1-(1-naphthalenethoxy)-2-(3-ketopyrrolidinyl)cyclohexane | CHEMBL229125
Type:
Small organic molecule
Emp. Form.:
C22H27NO2
Mol. Mass.:
337.4553
SMILES:
O=C1CCN(C1)[C@@H]1CCCC[C@H]1OCCc1cccc2ccccc12
: