Target
Sodium channel protein type 5 subunit alpha
Ligand
BDBM50213094
Substrate
Meas. Tech.
ChEMBL_436808 (CHEMBL905110)
IC50
15000±n/a nM
Citation
 Plouvier, BBeatch, GNJung, GLZolotoy, ASheng, TClohs, LBarrett, TDFedida, DWang, WQZhu, JJLiu, YAbraham, SLynn, LDong, YWall, RAWalker, MJ Synthesis and biological studies of novel 2-aminoalkylethers as potential antiarrhythmic agents for the conversion of atrial fibrillation. J Med Chem 50:2818-41 (2007)  
Target
Name:
Sodium channel protein type 5 subunit alpha
Synonyms:
HH1 SCN5A_HUMAN Sodium channel protein type 5 subunit alpha/beta-1/beta-2 Voltage-gated sodium channel subunit alpha Nav1.5
Type:
Enzyme
Mol. Mass.:
226908.60
Organism:
Homo sapiens (Human)
Description:
Q14524
Residue:
2016
  
Inhibitor
Name:
BDBM50213094
Synonyms:
(1R,2R)-1-(3,4-dichlorophenethoxy)-2-(4-morpholinyl)cyclohexane | CHEMBL387935
Type:
Small organic molecule
Emp. Form.:
C18H25Cl2NO2
Mol. Mass.:
358.303
SMILES:
Clc1ccc(CCO[C@@H]2CCCC[C@H]2N2CCOCC2)cc1Cl
: