Target
Mu-type opioid receptor
Ligand
BDBM50204449
Substrate
Meas. Tech.
ChEMBL_438282 (CHEMBL887388)
Ki
0.290000±n/a nM
Citation
 Peng, XKnapp, BIBidlack, JMNeumeyer, JL High-affinity carbamate analogues of morphinan at opioid receptors. Bioorg Med Chem Lett 17:1508-11 (2007)  
Target
Name:
Mu-type opioid receptor
Synonyms:
M-OR-1 MOR-1 MUOR1 Mu opiate receptor OPRM1 hMOP | mu-type opioid receptor isoform MOR-1
Type:
G Protein-Coupled Receptor (GPCR)
Mol. Mass.:
44789.51
Organism:
Homo sapiens (Human)
Description:
P35372
Residue:
400
  
Inhibitor
Name:
BDBM50204449
Synonyms:
CHEMBL427862 | MCL-449
Type:
Small organic molecule
Emp. Form.:
C23H32N2O2
Mol. Mass.:
368.5124
SMILES:
CCNC(=O)Oc1ccc2CC3C4CCCCC4(CCN3CC3CC3)c2c1
: