Target
C-X-C chemokine receptor type 3
Ligand
BDBM50211142
Substrate
Meas. Tech.
ChEMBL_438654 (CHEMBL888985)
IC50
299±n/a nM
Citation
 Johnson, MLi, ARLiu, JFu, ZZhu, LMiao, SWang, XXu, QHuang, AMarcus, AXu, FEbsworth, KSablan, EDanao, JKumer, JDairaghi, DLawrence, CSullivan, TTonn, GSchall, TCollins, TMedina, J Discovery and optimization of a series of quinazolinone-derived antagonists of CXCR3. Bioorg Med Chem Lett 17:3339-43 (2007)  
Target
Name:
C-X-C chemokine receptor type 3
Synonyms:
AAO92295.1 C-X-C chemokine receptor type 3 (CXCR3) CXCR3 CXCR3_HUMAN chemokine (C-X-C motif) receptor 3
Type:
Enzyme Catalytic Domain
Mol. Mass.:
40665.65
Organism:
Homo sapiens (Human)
Description:
Residue:
368
  
Inhibitor
Name:
BDBM50211142
Synonyms:
(R)-N-(1-(4-oxo-3-phenyl-3,4-dihydroquinazolin-2-yl)ethyl)-N-(pyridin-3-ylmethyl)-2-(4-(trifluoromethyl)phenyl)acetamide | CHEMBL397250
Type:
Small organic molecule
Emp. Form.:
C31H25F3N4O2
Mol. Mass.:
542.551
SMILES:
C[C@@H](N(Cc1cccnc1)C(=O)Cc1ccc(cc1)C(F)(F)F)c1nc2ccccc2c(=O)n1-c1ccccc1
: