Target
Glyceraldehyde-3-phosphate dehydrogenase
Ligand
BDBM50216861
Substrate
Meas. Tech.
ChEMBL_440186 (CHEMBL890500)
IC50
15000±n/a nM
Citation
 Kim, HDeng, LXiong, XHunter, WDLong, MCPirrung, MC Glyceraldehyde 3-phosphate dehydrogenase is a cellular target of the insulin mimic demethylasterriquinone B1. J Med Chem 50:3423-6 (2007)  
Target
Name:
Glyceraldehyde-3-phosphate dehydrogenase
Synonyms:
G3P_RABIT GAPDH
Type:
PROTEIN
Mol. Mass.:
35788.14
Organism:
Oryctolagus cuniculus
Description:
ChEMBL_980137
Residue:
333
  
Inhibitor
Name:
BDBM50216861
Synonyms:
2,5-dihydroxy-3-(7-(3-methylbut-2-enyl)-1H-indol-3-yl)-6-(2-(2-methylbut-3-en-2-yl)-1H-indol-3-yl)cyclohexa-2,5-diene-1,4-dione | CHEMBL245012
Type:
Small organic molecule
Emp. Form.:
C32H30N2O4
Mol. Mass.:
506.5916
SMILES:
CC(C)=CCc1cccc2c(c[nH]c12)C1C(=O)C(=O)C(c2c([nH]c3ccccc23)C(C)(C)C=C)C(=O)C1=O
: