Target
Amine oxidase [flavin-containing] A
Ligand
BDBM50175013
Substrate
Meas. Tech.
ChEMBL_440608 (CHEMBL889702)
IC50
>150000±n/a nM
Citation
 Hwang, JHHong, SSHan, XHHwang, JSLee, DLee, HYun, YPKim, YRo, JSHwang, BY Prenylated xanthones from the root bark of Cudrania tricuspidata. J Nat Prod 70:1207-9 (2007)  
Target
Name:
Amine oxidase [flavin-containing] A
Synonyms:
AOFA_MOUSE MAO-A Monoamine oxidase Monoamine oxidase type A
Type:
PROTEIN
Mol. Mass.:
59608.24
Organism:
Mus musculus
Description:
ChEMBL_122776
Residue:
526
  
Inhibitor
Name:
BDBM50175013
Synonyms:
1,3,6,7-tetrahydroxy-5-(3-methylbut-2-enyl)-2-(2-methylbut-3-en-2-yl)-9H-xanthen-9-one cudraxanthone L
Type:
Small organic molecule
Emp. Form.:
C23H24O6
Mol. Mass.:
396.4331
SMILES:
[#6]\[#6](-[#6])=[#6]\[#6]-c1c(-[#8])c(-[#8])cc2c1oc1cc(-[#8])c(c(-[#8])c1c2=O)C([#6])([#6])[#6]=[#6]
: