Target
Mandelate racemase
Ligand
BDBM50197008
Substrate
Meas. Tech.
ChEMBL_440757 (CHEMBL889854)
Ki
2670±n/a nM
Citation
 Bourque, JRBurley, RKBearne, SL Intermediate analogue inhibitors of mandelate racemase: N-Hydroxyformanilide and cupferron. Bioorg Med Chem Lett 17:105-8 (2006)  
Target
Name:
Mandelate racemase
Synonyms:
MANR_PSEPU Mandelate racemase (MR) | mdlA
Type:
Protein
Mol. Mass.:
38561.77
Organism:
Pseudomonas putida (g-Proteobacteria)
Description:
Residue:
359
  
Inhibitor
Name:
BDBM50197008
Synonyms:
CHEMBL388471 cupferron
Type:
Small organic molecule
Emp. Form.:
C6H6N2O2
Mol. Mass.:
138.124
SMILES:
ON(N=O)c1ccccc1
: