Target
C-C chemokine receptor type 5
Ligand
BDBM50190520
Substrate
Meas. Tech.
ChEMBL_441026 (CHEMBL890113)
IC50
8.3±n/a nM
Citation
 Nishizawa, RNishiyama, THisaichi, KMatsunaga, NMinamoto, CHabashita, HTakaoka, YToda, MShibayama, STada, HSagawa, KFukushima, DMaeda, KMitsuya, H Spirodiketopiperazine-based CCR5 antagonists: Lead optimization from biologically active metabolite. Bioorg Med Chem Lett 17:727-31 (2007)  
Target
Name:
C-C chemokine receptor type 5
Synonyms:
C-C CKR-5 CC-CKR-5 CCR5 CCR5_HUMAN CHEMR13 HIV-1 fusion coreceptor
Type:
Enzyme
Mol. Mass.:
40540.21
Organism:
Homo sapiens (Human)
Description:
P51681
Residue:
352
  
Inhibitor
Name:
BDBM50190520
Synonyms:
(RS)-1-butyl-3-isobutyl-9-(4-phenoxybenzyl)-1,4,9-triazaspiro[5.5]undecane-2,5-dione hydrochloride 1-butyl-3-isobutyl-9-(4-phenoxy-benzyl)-1,4,9-triaza-spiro[5.5]undecane-2,5-dione hydrochloride rac-1-Butyl-3-isobutyl-9-(4-phenoxybenzyl)-1,4,9-triazaspiro[5.5]undecane-2,5-dione hydrochloride
Type:
Small organic molecule
Emp. Form.:
C29H39N3O3
Mol. Mass.:
477.6383
SMILES:
CCCCN1C(=O)C(CC(C)C)NC(=O)C11CCN(Cc2ccc(Oc3ccccc3)cc2)CC1
: