Target
Carbonic anhydrase 12
Ligand
BDBM12916
Substrate
Meas. Tech.
ChEMBL_441219 (CHEMBL891443)
Ki
1±n/a nM
Citation
 Wilkinson, BLBornaghi, LFHouston, TAInnocenti, AVullo, DSupuran, CTPoulsen, SA Inhibition of membrane-associated carbonic anhydrase isozymes IX, XII and XIV with a library of glycoconjugate benzenesulfonamides. Bioorg Med Chem Lett 17:987-92 (2007)  
Target
Name:
Carbonic anhydrase 12
Synonyms:
CA-XII CAH12_HUMAN Carbonic anhydrase Carbonic anhydrase XII Carbonic anhydrase XII (CAXII) | Tumor antigen HOM-RCC-3.1.3
Type:
Enzyme
Mol. Mass.:
39456.00
Organism:
Homo sapiens (Human)
Description:
Catalytic domain of human cloned isozyme was used in the assay
Residue:
354
  
Inhibitor
Name:
BDBM12916
Synonyms:
CHEMBL386542 N-(prop-2-yn-1-yl)-4-sulfamoylbenzamide | N-propynyl amide derivative 2
Type:
Small organic molecule
Emp. Form.:
C10H10N2O3S
Mol. Mass.:
238.263
SMILES:
NS(=O)(=O)c1ccc(cc1)C(=O)NCC#C
: