Target
Broad substrate specificity ATP-binding cassette transporter ABCG2
Ligand
BDBM50371103
Substrate
Meas. Tech.
ChEMBL_442566 (CHEMBL892735)
IC50
>20000±n/a nM
Citation
 Boumendjel, AMacalou, SAhmed-Belkacem, ABlanc, MDi Pietro, A Acridone derivatives: design, synthesis, and inhibition of breast cancer resistance protein ABCG2. Bioorg Med Chem 15:2892-7 (2007)  
Target
Name:
Broad substrate specificity ATP-binding cassette transporter ABCG2
Synonyms:
ABCG2 ABCP ATP-binding cassette sub-family G member 2 ATP-binding cassette, sub-family G, member 2 BCRP1 CDw338 Mitoxantrone resistance-associated protein Urate exporter
Type:
Multi-pass membrane protein; monomer or homodimer; disulfide-linked
Mol. Mass.:
72329.48
Organism:
Homo sapiens (Human)
Description:
Q9UNQ0
Residue:
655
  
Inhibitor
Name:
BDBM50371103
Synonyms:
CHEMBL242942
Type:
Small organic molecule
Emp. Form.:
C14H11NO3
Mol. Mass.:
241.242
SMILES:
COc1cc(O)c2c(c1)[nH]c1ccccc1c2=O
: