Target
Metabotropic glutamate receptor 1
Ligand
BDBM17657
Substrate
Meas. Tech.
ChEMBL_443085 (CHEMBL892216)
EC50
7300±n/a nM
Citation
 Marinozzi, MSerpi, MAmori, LGavilan Diaz, MCostantino, GMeyer, UFlor, PJGasparini, FHeckendorn, RKuhn, RGiorgi, GHermit, MBThomsen, CPellicciari, R Synthesis and preliminary pharmacological evaluation of the four stereoisomers of (2S)-2-(2'-phosphono-3'-phenylcyclopropyl)glycine, the first class of 3'-substituted trans C1'-2'-2-(2'-phosphonocyclopropyl)glycines. Bioorg Med Chem 15:3161-70 (2007)  
Target
Name:
Metabotropic glutamate receptor 1
Synonyms:
GRM1_RAT Grm1 Metabotropic glutamate receptor Mglur1 metabotropic glutamate 1/5-D metabotropic glutamate receptor 1 isoform alpha precursor
Type:
Enzyme Catalytic Domain
Mol. Mass.:
133240.47
Organism:
RAT
Description:
metabotropic glutamate 1/2 0 RAT::P23385
Residue:
1199
  
Inhibitor
Name:
BDBM17657
Synonyms:
(2S)-2-aminopentanedioic acid D-Glutamate L-Glu L-Glutamic acid L-gluatmate
Type:
Amino Acid
Emp. Form.:
C5H9NO4
Mol. Mass.:
147.1293
SMILES:
N[C@@H](CCC(O)=O)C(O)=O
: