Target
Metabotropic glutamate receptor 7
Ligand
BDBM50207813
Substrate
Meas. Tech.
ChEMBL_443090 (CHEMBL892221)
EC50
>1000000±n/a nM
Citation
 Marinozzi, MSerpi, MAmori, LGavilan Diaz, MCostantino, GMeyer, UFlor, PJGasparini, FHeckendorn, RKuhn, RGiorgi, GHermit, MBThomsen, CPellicciari, R Synthesis and preliminary pharmacological evaluation of the four stereoisomers of (2S)-2-(2'-phosphono-3'-phenylcyclopropyl)glycine, the first class of 3'-substituted trans C1'-2'-2-(2'-phosphonocyclopropyl)glycines. Bioorg Med Chem 15:3161-70 (2007)  
Target
Name:
Metabotropic glutamate receptor 7
Synonyms:
GPRC1G GRM7 protein MGLUR7 metabotropic glutamate 7
Type:
Enzyme Catalytic Domain
Mol. Mass.:
102262.98
Organism:
Homo sapiens (Human)
Description:
Q14831
Residue:
915
  
Inhibitor
Name:
BDBM50207813
Synonyms:
(2S,1'S,2'R,3'S)-2-(2'-phosphono-3'-phenylcyclopropyl)glycine | CHEMBL392419
Type:
Small organic molecule
Emp. Form.:
C11H14NO5P
Mol. Mass.:
271.2063
SMILES:
NC([C@@H]1[C@H]([C@H]1P(O)(O)=O)c1ccccc1)C(O)=O
: