Target
Iron-starvation protein PigA
Ligand
BDBM50371139
Substrate
Meas. Tech.
ChEMBL_444781 (CHEMBL895029)
Kd
15900±n/a nM
Citation
 Furci, LMLopes, PEakanunkul, SZhong, SMacKerell, ADWilks, A Inhibition of the bacterial heme oxygenases from Pseudomonas aeruginosa and Neisseria meningitidis: novel antimicrobial targets. J Med Chem 50:3804-13 (2007)  
Target
Name:
Iron-starvation protein PigA
Synonyms:
Heme oxygenase | Iron-starvation protein PigA
Type:
PROTEIN
Mol. Mass.:
21946.19
Organism:
Pseudomonas aeruginosa
Description:
ChEMBL_444781
Residue:
198
  
Inhibitor
Name:
BDBM50371139
Synonyms:
CHEMBL395101
Type:
Small organic molecule
Emp. Form.:
C13H13N7
Mol. Mass.:
267.2892
SMILES:
NC(NN=Cc1cccnc1)=NN=Cc1cccnc1
: