Target
P2X purinoceptor 3
Ligand
BDBM50219120
Substrate
Meas. Tech.
ChEMBL_445406 (CHEMBL895696)
IC50
0.0083±n/a nM
Citation
 Jung, KYMoon, HDLee, GELim, HHPark, CSKim, YC Structure-activity relationship studies of spinorphin as a potent and selective human P2X(3) receptor antagonist. J Med Chem 50:4543-7 (2007)  
Target
Name:
P2X purinoceptor 3
Synonyms:
ATP receptor P2RX3 P2X purinoceptor 3 P2X purinoceptor 3 (P2X3) P2X3 purinoceptor p2x3 + hsa
Type:
Protein
Mol. Mass.:
44292.02
Organism:
Homo sapiens (Human)
Description:
P56373
Residue:
397
  
Inhibitor
Name:
BDBM50219120
Synonyms:
CHEMBL395493 | LVVYPWT
Type:
Small organic molecule
Emp. Form.:
C45H64N8O10
Mol. Mass.:
877.0373
SMILES:
CC(C)C[C@H](N)C(=O)N[C@@H](C(C)C)C(=O)N[C@@H](C(C)C)C(=O)N[C@@H](Cc1ccc(O)cc1)C(=O)N1CCC[C@H]1C(=O)N[C@@H](Cc1c[nH]c2ccccc12)C(=O)N[C@@H]([C@@H](C)O)C(O)=O
: