Target
Sigma non-opioid intracellular receptor 1
Ligand
BDBM50179260
Substrate
Meas. Tech.
ChEMBL_445893 (CHEMBL896183)
Ki
0.35±n/a nM
Citation
 Ferorelli, SAbate, CColabufo, NANiso, MInglese, CBerardi, FPerrone, R Design and evaluation of naphthol- and carbazole-containing fluorescent sigma ligands as potential probes for receptor binding studies. J Med Chem 50:4648-55 (2007)  
Target
Name:
Sigma non-opioid intracellular receptor 1
Synonyms:
OPRS1 SIGMAR1 Sigma non-opioid intracellular receptor 1 Sigma1-receptor Sterol isomerase-like protein
Type:
Protein
Mol. Mass.:
25307.17
Organism:
Cavia porcellus (Guinea pig)
Description:
Q60492
Residue:
223
  
Inhibitor
Name:
BDBM50179260
Synonyms:
1-(3-(6-methoxynaphthalen-1-yl)propyl)-3,3-dimethylpiperidine hydrochloride CHEMBL178326 | CHEMBL537177
Type:
Small organic molecule
Emp. Form.:
C21H29NO
Mol. Mass.:
311.4611
SMILES:
COc1ccc2c(CCCN3CCCC(C)(C)C3)cccc2c1
: