Target
Neuronal acetylcholine receptor subunit alpha-7
Ligand
BDBM50220053
Substrate
Meas. Tech.
ChEMBL_445993 (CHEMBL896286)
IC50
1148±n/a nM
Citation
 Jensen, AAZlotos, DPLiljefors, T Pharmacological characteristics and binding modes of caracurine V analogues and related compounds at the neuronal alpha7 nicotinic acetylcholine receptor. J Med Chem 50:4616-29 (2007)  
Target
Name:
Neuronal acetylcholine receptor subunit alpha-7
Synonyms:
ACHA7_HUMAN Cholinergic, Nicotinic Alpha7 Neuronal acetylcholine receptor protein alpha-7 subunit Nicotinic acetylcholine receptor alpha-7 (alpha7 nAChR)
Type:
Mol. Mass.:
56448.33
Organism:
Homo sapiens (Human)
Description:
CHRNA7 (NACHRA7)
Residue:
502
  
Inhibitor
Name:
BDBM50220053
Synonyms:
(1S,9R,18R,19S,21R,22R,23R,25R,32S,34R,35R,36S)-15,31-bis[(2E)-but-2-en-1-yl]-24-phenyl-10,26-dioxa-8,15,24,31-tetraazaundecacyclo[29.5.2.0^{1,32}.0^{2,7}.0^{8,36}.0^{9,22}.0^{13,21}.0^{15,19}.0^{18,23}.0^{25,35}.0^{29,34}]octatriaconta-2,4,6,12,28-pentaene-15,31-diium dibromide | CHEMBL230952
Type:
Small organic molecule
Emp. Form.:
C46H56N4O2
Mol. Mass.:
696.9613
SMILES:
C\C=C\C[N+]12CC[C@H]3[C@@H]1C[C@@H]1[C@@H]4[C@@H]3N([C@@H]3OCC=C5C[N+]6(C\C=C\C)CC[C@@]78[C@@H]6C[C@@H]5[C@@H]3[C@@H]7N([C@@H]4OCC=C1C2)c1ccccc81)c1ccccc1
: