Target
Metabotropic glutamate receptor 1
Ligand
BDBM17657
Substrate
Meas. Tech.
ChEMBL_446048 (CHEMBL895144)
Ki
250±n/a nM
Citation
 Pellicciari, RMarinozzi, MMacchiarulo, AFulco, MCGafarova, JSerpi, MGiorgi, GNielsen, SThomsen, C Synthesis, molecular modeling studies, and preliminary pharmacological characterization of all possible 2-(2'-sulfonocyclopropyl)glycine stereoisomers as conformationally constrained L-homocysteic acid analogs. J Med Chem 50:4630-41 (2007)  
Target
Name:
Metabotropic glutamate receptor 1
Synonyms:
GPRC1A GRM1_HUMAN Metabotropic Glutamate 1a | metabotropic glutamate 1
Type:
Enzyme
Mol. Mass.:
132358.19
Organism:
Homo sapiens (Human)
Description:
Q13255
Residue:
1194
  
Inhibitor
Name:
BDBM17657
Synonyms:
(2S)-2-aminopentanedioic acid D-Glutamate L-Glu L-Glutamic acid L-gluatmate
Type:
Amino Acid
Emp. Form.:
C5H9NO4
Mol. Mass.:
147.1293
SMILES:
N[C@@H](CCC(O)=O)C(O)=O
: