Target
Metabotropic glutamate receptor 5
Ligand
BDBM50220145
Substrate
Meas. Tech.
ChEMBL_446050 (CHEMBL895146)
Ki
>300000±n/a nM
Citation
 Pellicciari, RMarinozzi, MMacchiarulo, AFulco, MCGafarova, JSerpi, MGiorgi, GNielsen, SThomsen, C Synthesis, molecular modeling studies, and preliminary pharmacological characterization of all possible 2-(2'-sulfonocyclopropyl)glycine stereoisomers as conformationally constrained L-homocysteic acid analogs. J Med Chem 50:4630-41 (2007)  
Target
Name:
Metabotropic glutamate receptor 5
Synonyms:
GPRC1E GRM5_HUMAN metabotropic glutamate 5 | metabotropic glutamate 5a
Type:
Enzyme
Mol. Mass.:
132484.72
Organism:
Homo sapiens (Human)
Description:
Residue:
1212
  
Inhibitor
Name:
BDBM50220145
Synonyms:
(2S,1'R,2'R)-2-(2'-sulfonocyclopropyl)glycine | CHEMBL389557
Type:
Small organic molecule
Emp. Form.:
C5H9NO5S
Mol. Mass.:
195.194
SMILES:
N[C@@H]([C@H]1C[C@H]1S(O)(=O)=O)C(O)=O
: